Custom Query (541 matches)

Filters
 
Or
 
  
 
Columns

Show under each result:


Results (49 - 51 of 541)

Ticket Resolution Summary Owner Reporter
#31 fixed Linux 64 bit build fails on gcf2ew somebody stefan
Description

Paul sez: we need to build a liblinux64 binary for the gcf2ew module

Symptoms are an error message making it look like the "make unix" build failed:

[[[

gcc -o /home/slisowski/download/earthworm/bin/gcf2ew convert.o getconfig.o main.o scn_map.o heart.o  die.o logo.o options.o /home/slisowski/download/earthworm/lib/getutil.o /home/slisowski/download/earthworm/lib/kom.o /home/slisowski/download/earthworm/lib/logit_mt.o /home/slisowski/download/earthworm/lib/sema_ew.o /home/slisowski/download/earthworm/lib/threads_ew.o /home/slisowski/download/earthworm/lib/time_ew.o /home/slisowski/download/earthworm/lib/sleep_ew.o /home/slisowski/download/earthworm/lib/transport.o -Lgcf/liblinux32 -lgcf -lpthread -lm
/usr/bin/ld: skipping incompatible gcf/liblinux32/libgcf.a when searching for -lgcf
/usr/bin/ld: cannot find -lgcf
collect2: ld returned 1 exit status
make[2]: *** [gcf2ew] Error 1
make[2]: Leaving directory `/home/slisowski/download/earthworm/src/data_sources/gcf2ew'
make[1]: *** [unix_modules] Error 2
make[1]: Leaving directory `/home/slisowski/download/earthworm/src/data_sources'
make: *** [unix_modules] Error 2

]]]

#32 fixed trig2disk compile fails somebody stefan
Description

Does this have to do with Tim's WFDISC work?

/home/slisowski/download/earthworm/lib/putaway.o: In function `PA_init':
/home/slisowski/download/earthworm/src/libsrc/util/putaway.c:219: undefined reference to `WFDISCPA_init'
/home/slisowski/download/earthworm/lib/putaway.o: In function `PA_next_ev':
/home/slisowski/download/earthworm/src/libsrc/util/putaway.c:372: undefined reference to `WFDISCPA_next_ev'
/home/slisowski/download/earthworm/lib/putaway.o: In function `PA_next':
/home/slisowski/download/earthworm/src/libsrc/util/putaway.c:485: undefined reference to `WFDISCPA_next'
/home/slisowski/download/earthworm/lib/putaway.o: In function `PA_end_ev':
/home/slisowski/download/earthworm/src/libsrc/util/putaway.c:589: undefined reference to `WFDISCPA_end_ev'
/home/slisowski/download/earthworm/lib/putaway.o: In function `PA_close':
/home/slisowski/download/earthworm/src/libsrc/util/putaway.c:690: undefined reference to `WFDISCPA_close'
collect2: ld returned 1 exit status
make[2]: *** [trig2disk] Error 1
make[2]: Leaving directory `/home/slisowski/download/earthworm/src/archiving/trig2disk'
#34 fixed eqassemble compile fails 64 bit linux somebody stefan
Description
Making unix_modules in:
/home/slisowski/download/earthworm/src/seismic_processing/eqassemble
make[2]: Entering directory `/home/slisowski/download/earthworm/src/seismic_processing/eqassemble'
make -f makefile.ux eqassemble
make[3]: Entering directory `/home/slisowski/download/earthworm/src/seismic_processing/eqassemble'
/usr/bin/gcc -m32 -Dlinux -D__i386 -D_LINUX -D_INTEL -D_USE_SCHED  -D_USE_PTHREADS -D_USE_TERMIOS -I/home/slisowski/download/earthworm/include -m32 -Dlinux -D__i386 -D_LINUX -D_INTEL -D_USE_SCHED  -D_USE_PTHREADS -D_USE_TERMIOS -I/home/slisowski/download/earthworm/include  -c -o eqassemble.o eqassemble.c
In file included from /usr/include/math.h:71,
                 from eqassemble.c:24:
/usr/include/bits/mathcalls.h:163: error: expected declaration specifiers or ‘...’ before â€ken€™ too
eqassemble.c: In function ‘eqas_cancelevent’:
eqassemble.c:1213: warning: format ‘%d’ expects type ‘int’, but argument 3 has type ‘long int’
make[3]: *** [eqassemble.o] Error 1
'ake[3]: Leaving directory `/home/slisowski/download/earthworm/src/seismic_processing/eqassemblemake[2]: *** [all] Error 2
make[2]: Leaving directory `/home/slisowski/download/earthworm/src/seismic_processing/eqassemble'
Note: See TracQuery for help on using queries.