Custom Query (541 matches)

Filters
 
Or
 
  
 
Columns

Show under each result:


Results (28 - 30 of 541)

1 2 3 4 5 6 7 8 9 10 11 12 13 14 15 16 17 18 19 20
Ticket Resolution Summary Owner Reporter
#32 fixed trig2disk compile fails somebody stefan
Description

Does this have to do with Tim's WFDISC work?

/home/slisowski/download/earthworm/lib/putaway.o: In function `PA_init':
/home/slisowski/download/earthworm/src/libsrc/util/putaway.c:219: undefined reference to `WFDISCPA_init'
/home/slisowski/download/earthworm/lib/putaway.o: In function `PA_next_ev':
/home/slisowski/download/earthworm/src/libsrc/util/putaway.c:372: undefined reference to `WFDISCPA_next_ev'
/home/slisowski/download/earthworm/lib/putaway.o: In function `PA_next':
/home/slisowski/download/earthworm/src/libsrc/util/putaway.c:485: undefined reference to `WFDISCPA_next'
/home/slisowski/download/earthworm/lib/putaway.o: In function `PA_end_ev':
/home/slisowski/download/earthworm/src/libsrc/util/putaway.c:589: undefined reference to `WFDISCPA_end_ev'
/home/slisowski/download/earthworm/lib/putaway.o: In function `PA_close':
/home/slisowski/download/earthworm/src/libsrc/util/putaway.c:690: undefined reference to `WFDISCPA_close'
collect2: ld returned 1 exit status
make[2]: *** [trig2disk] Error 1
make[2]: Leaving directory `/home/slisowski/download/earthworm/src/archiving/trig2disk'
#33 fixed Archman compile fails paulf stefan
Description

Archman compile fails 64 bit linux and on Windows

archman.c:(.text+0x22fa): warning: the use of `tmpnam' is dangerous, better use `mkstemp'
/usr/bin/ld: i386 architecture of input file `archman.o' is incompatible with i386:x86-64 output
/usr/bin/ld: i386 architecture of input file `/home/slisowski/download/earthworm/lib/threads_ew.o' is incompatible with i386:x86-64 output
/usr/bin/ld: i386 architecture of input file `/home/slisowski/download/earthworm/lib/getutil.o' is incompatible with i386:x86-64 output
/usr/bin/ld: i386 architecture of input file `/home/slisowski/download/earthworm/lib/kom.o' is incompatible with i386:x86-64 output
/usr/bin/ld: i386 architecture of input file `/home/slisowski/download/earthworm/lib/logit_mt.o' is incompatible with i386:x86-64 output
/usr/bin/ld: i386 architecture of input file `/home/slisowski/download/earthworm/lib/socket_ew.o' is incompatible with i386:x86-64 output
/usr/bin/ld: i386 architecture of input file `/home/slisowski/download/earthworm/lib/socket_ew_common.o' is incompatible with i386:x86-64 output
/usr/bin/ld: i386 architecture of input file `/home/slisowski/download/earthworm/lib/transport.o' is incompatible with i386:x86-64 output
/usr/bin/ld: i386 architecture of input file `/home/slisowski/download/earthworm/lib/sleep_ew.o' is incompatible with i386:x86-64 output
/usr/bin/ld: i386 architecture of input file `/home/slisowski/download/earthworm/lib/time_ew.o' is incompatible with i386:x86-64 output
/usr/bin/ld: i386 architecture of input file `/home/slisowski/download/earthworm/lib/sema_ew.o' is incompatible with i386:x86-64 output
/usr/bin/ld: i386 architecture of input file `/home/slisowski/download/earthworm/lib/swap.o' is incompatible with i386:x86-64 output
/usr/bin/ld: i386 architecture of input file `lib/libbgs.a(chk_clk.o)' is incompatible with i386:x86-64 output
/usr/bin/ld: i386 architecture of input file `lib/libbgs.a(copy_file.o)' is incompatible with i386:x86-64 output
/usr/bin/ld: i386 architecture of input file `lib/libbgs.a(dy_in_mn.o)' is incompatible with i386:x86-64 output
/usr/bin/ld: i386 architecture of input file `lib/libbgs.a(is_leap.o)' is incompatible with i386:x86-64 output
/usr/bin/ld: i386 architecture of input file `lib/libbgs.a(string.o)' is incompatible with i386:x86-64 output
/usr/bin/ld: i386 architecture of input file `lib/libbgs.a(chk_num.o)' is incompatible with i386:x86-64 output
/usr/bin/ld: i386 architecture of input file `lib/libbgs.a(utils.o)' is incompatible with i386:x86-64 output
/usr/bin/ld: i386 architecture of input file `lib/libbgs.a(utils_sol.o)' is incompatible with i386:x86-64 output
collect2: ld returned 1 exit status
make[2]: *** [archman] Error 1
make[2]: Leaving directory `/home/slisowski/download/earthworm/src/archiving/archman'
make[1]: *** [unix_modules] Error 2

-- this is only archman, not "ALL modules"; archman is a new module though

#34 fixed eqassemble compile fails 64 bit linux somebody stefan
Description
Making unix_modules in:
/home/slisowski/download/earthworm/src/seismic_processing/eqassemble
make[2]: Entering directory `/home/slisowski/download/earthworm/src/seismic_processing/eqassemble'
make -f makefile.ux eqassemble
make[3]: Entering directory `/home/slisowski/download/earthworm/src/seismic_processing/eqassemble'
/usr/bin/gcc -m32 -Dlinux -D__i386 -D_LINUX -D_INTEL -D_USE_SCHED  -D_USE_PTHREADS -D_USE_TERMIOS -I/home/slisowski/download/earthworm/include -m32 -Dlinux -D__i386 -D_LINUX -D_INTEL -D_USE_SCHED  -D_USE_PTHREADS -D_USE_TERMIOS -I/home/slisowski/download/earthworm/include  -c -o eqassemble.o eqassemble.c
In file included from /usr/include/math.h:71,
                 from eqassemble.c:24:
/usr/include/bits/mathcalls.h:163: error: expected declaration specifiers or ‘...’ before â€ken€™ too
eqassemble.c: In function ‘eqas_cancelevent’:
eqassemble.c:1213: warning: format ‘%d’ expects type ‘int’, but argument 3 has type ‘long int’
make[3]: *** [eqassemble.o] Error 1
'ake[3]: Leaving directory `/home/slisowski/download/earthworm/src/seismic_processing/eqassemblemake[2]: *** [all] Error 2
make[2]: Leaving directory `/home/slisowski/download/earthworm/src/seismic_processing/eqassemble'
1 2 3 4 5 6 7 8 9 10 11 12 13 14 15 16 17 18 19 20
Note: See TracQuery for help on using queries.