Ticket #229 (new defect)

Opened 8 years ago

Last modified 8 years ago

PsnAdSend won't compile on osx intel

Reported by: stefan Owned by: somebody
Priority: major Milestone: OSX Intel
Component: ALL modules Version: 7.7
Keywords: Cc:

Description

Making unix_modules in:
/opt/earthworm/earthworm_svn/src/data_sources/psnadsend
c++    -c -o PsnAdSend.o PsnAdSend.cpp
In file included from PsnAdSend.cpp:8:
./PsnAdSend.h:17:10: fatal error: 'earthworm.h' file not found
#include <earthworm.h>
         ^
1 error generated.
make[2]: *** [PsnAdSend.o] Error 1
make[1]: *** [unix_modules] Error 2
make: *** [unix_modules] Error 2

Change History

comment:1 Changed 8 years ago by stefan

Also fails on Ubuntu 12 64 bit, though succeeds on CentOS 6.3 64 bit.

Ubuntu:

Making unix_modules in: /opt/earthworm/earthworm_svn/src/data_sources/psnadsend make[2]: Entering directory `/opt/earthworm/earthworm_svn/src/data_sources/psnadsend' g++ -m32 -Dlinux -Di386 -D_LINUX -D_INTEL -D_USE_SCHED -D_USE_PTHREADS -D_USE_TERMIOS -I/opt/earthworm/earthworm_svn/include -c -o PsnAdSend?.o PsnAdSend?.cpp make[2]: g++: Command not found make[2]: * [PsnAdSend?.o] Error 127 make[2]: Leaving directory `/opt/earthworm/earthworm_svn/src/data_sources/psnadsend' make[1]: * [unix_modules] Error 2 make[1]: Leaving directory `/opt/earthworm/earthworm_svn/src/data_sources' make: * [unix_modules] Error 2

Note: See TracTickets for help on using tickets.